This bugzilla service is closed. All entries have been migrated to https://gitlab.com/libeigen/eigen
Bug 1444 - some tests failed
Summary: some tests failed
Status: NEW
Alias: None
Product: Eigen
Classification: Unclassified
Component: Tests (show other bugs)
Version: 3.3 (current stable)
Hardware: All All
: Normal Unknown
Assignee: Nobody
URL:
Whiteboard:
Keywords:
Depends on:
Blocks:
 
Reported: 2017-06-23 17:11 UTC by Albert
Modified: 2019-12-04 17:04 UTC (History)
3 users (show)



Attachments

Description Albert 2017-06-23 17:11:15 UTC
Dear All,

my system: Ubuntu 16.04/64
compilation:
   cmake -DCMAKE_INSTALL_PREFIX=${custom folder} ../
   make blas
   make check
   make install
There are system-wide libraries Blas, Lapack, etc. installed,
as well as some other ones in the locally visible folder.

/////////////////////////////////////

99% tests passed, 3 tests failed out of 796

Label Time Summary:
Official       = 316.01 sec (674 tests)
Unsupported    =  67.60 sec (109 tests)

Total Test time (real) = 537.39 sec

The following tests FAILED:
	480 - bdcsvd_9 (OTHER_FAULT)
	741 - sparse_extra_3 (OTHER_FAULT)
	790 - cxx11_tensor_io (SEGFAULT)
Errors while running CTest
CMakeFiles/check.dir/build.make:57: recipe for target 'CMakeFiles/check' failed
make[3]: *** [CMakeFiles/check] Error 8
CMakeFiles/Makefile2:1213: recipe for target 'CMakeFiles/check.dir/all' failed
make[2]: *** [CMakeFiles/check.dir/all] Error 2
CMakeFiles/Makefile2:1220: recipe for target 'CMakeFiles/check.dir/rule' failed
make[1]: *** [CMakeFiles/check.dir/rule] Error 2
Makefile:316: recipe for target 'check' failed
make: *** [check] Error 2
Comment 1 Nobody 2019-12-04 17:04:51 UTC
-- GitLab Migration Automatic Message --

This bug has been migrated to gitlab.com's GitLab instance and has been closed from further activity.

You can subscribe and participate further through the new bug through this link to our GitLab instance: https://gitlab.com/libeigen/eigen/issues/1444.

Note You need to log in before you can comment on or make changes to this bug.